{"text_format":"1","workbook":"xlsx","n_sheets":3,"sheets":["饲料筛介绍","输入您的数据","Recommandations"],"not_rendered":{"charts":1,"images":8,"macros":1,"external_links":0,"defined_names":3,"comments":0,"pivot_tables":0},"unopened":[],"bounds":{"document_bytes":16777216,"sheet_cells":100000,"rows_first":2000,"rows_last":500,"rows_between":2000,"halvings":0,"cell_chars":16384,"cell_head_chars":4096},"cells_cut":0,"cells_raw":0,"read":"whole","date_system":"1900"}

{"sheet":"饲料筛介绍","index":0,"n_rows":12,"n_cols":2,"rows_kept":12,"cut":false,"hidden":false,"merged":[[11,1,12,16],[5,1,5,7],[0,1,0,16],[1,1,1,16],[2,1,2,16],[3,1,3,16],[5,9,5,12]]}
[null,"饲料筛介绍"]
[null,"1 - 取下饲料筛的盖子，将盖子竖直插入＞3毫米隔层中间的槽中。\n2 - 正确取样饲料，将饲料放入左侧隔层。"]
[null,"3 - 取出盖子，将盖子放回原槽内以关闭饲料筛。\n4 - 将哈伯德饲料筛竖直放置（＞3毫米隔层在上部），左右上下摇动60秒。"]
[null,"6 - 读取结果，使用位于每个隔层左侧的刻度尺记录每个隔层中的进料量。\n7 - 在本Excel文件“输入您的数据”工作表中输入结果。\n8 - 取下盖子，清空筛子中的饲料。用刷子清洁筛网。\n9 - 为了对饲料样本进行良好的分析，对同一种饲料重复该程序至少5次。"]
[]
[]
[]
[]
[]
[]
[]
[null,"www.hubbardbreeders.com"]

{"sheet":"输入您的数据","index":1,"n_rows":46,"n_cols":16,"rows_kept":46,"cut":false,"hidden":false,"merged":[[0,4,2,15],[3,5,3,7],[3,8,3,15],[21,4,41,15],[12,4,13,4],[48,4,1048575,15],[4,8,10,15],[42,4,42,15],[43,4,44,15],[45,4,45,15],[12,10,20,10],[12,11,12,15],[12,5,12,9],[4,5,4,7],[6,5,6,7],[7,5,7,7],[9,5,9,7],[10,5,10,7],[8,5,8,7],[5,5,5,7]]}
[null,null,null,null,"       父母代鸡群饲料物理质量记录表"]
[]
[]
[null,null,null,null,"公司","Hubbard",null,null,"如何使用该文件？"]
[null,null,null,null,"日期","2023-11-28",null,null,"1 - 在绿色表格中输入数值或进行选择：\n重要的是要对饲料类型和饲料形态进行正确选择，以便和哈伯德推荐进行正确比对。\n\n2 - 解释/图例：\n结果符合哈伯德推荐\n结果不符合哈伯德推荐"]
[null,null,null,null,"品种","PS EFFICIENCY PLUS"]
[null,null,null,null,"农场名称","Cocorico"]
[null,null,null,null,"鸡舍号",1]
[null,null,null,null,"饲料场","Feed  Plus"]
[null,null,null,null,"饲料类型","产蛋I号料"]
[null,null,null,null,"饲料形态","粗粉料"]
[]
[null,null,null,null,null,"输入饲料筛上读取的数值",null,null,null,null,null,"占比%"]
[null,null,null,null,null,">3mm","2-3mm","1-2mm","<1mm","合计",null,">3mm","2-3mm","1-2mm","<1mm","Total"]
[null,null,null,null,"1号子样本",10,45,35,10,{"$f":"IF(OR(F15=\"\",G15=\"\",H15=\"\",I15=\"\"),\"\",SUM(F15:I15))","v":100},null,{"$f":"IF(J15=\"\",\"\",F15/$J15)","v":0.1},{"$f":"IF(J15=\"\",\"\",G15/$J15)","v":0.45},{"$f":"IF(J15=\"\",\"\",H15/$J15)","v":0.35},{"$f":"IF(J15=\"\",\"\",I15/$J15)","v":0.1},{"$f":"IF(J15=\"\",\"\",J15/$J15)","v":1}]
[null,null,null,null,"2号子样本",12.5,42.5,32.5,15,{"$f":"IF(OR(F16=\"\",G16=\"\",H16=\"\",I16=\"\"),\"\",SUM(F16:I16))","v":102.5},null,{"$f":"IF(J16=\"\",\"\",F16/$J16)","v":0.12195121951219512},{"$f":"IF(J16=\"\",\"\",G16/$J16)","v":0.41463414634146339},{"$f":"IF(J16=\"\",\"\",H16/$J16)","v":0.31707317073170732},{"$f":"IF(J16=\"\",\"\",I16/$J16)","v":0.14634146341463414},{"$f":"IF(J16=\"\",\"\",J16/$J16)","v":1}]
[null,null,null,null,"3号子样本",15,40,30,15,100,null,{"$f":"IF(J17=\"\",\"\",F17/$J17)","v":0.15},0.4,{"$f":"IF(J17=\"\",\"\",H17/$J17)","v":0.3},0.15,1]
[null,null,null,null,"4号子样本",17.5,37.5,27.5,12.5,95,null,{"$f":"IF(J18=\"\",\"\",F18/$J18)","v":0.18421052631578946},{"$f":"IF(J18=\"\",\"\",G18/$J18)","v":0.39473684210526316},0.28947368421052633,0.13157894736842105,1]
[null,null,null,null,"5号子样本",20,35,25,15,{"$f":"IF(OR(F19=\"\",G19=\"\",H19=\"\",I19=\"\"),\"\",SUM(F19:I19))","v":95},null,{"$f":"IF(J19=\"\",\"\",F19/$J19)","v":0.21052631578947367},{"$f":"IF(J19=\"\",\"\",G19/$J19)","v":0.36842105263157893},0.26315789473684209,0.15789473684210525,1]
[null,null,null,null,"平均值",{"$f":"IF($F$15>0.001,AVERAGE(F15:F19),\"\")","v":15},{"$f":"IF($F$15>0.001,AVERAGE(G15:G19),\"\")","v":40},{"$f":"IF($F$15>0.001,AVERAGE(H15:H19),\"\")","v":30},{"$f":"IF($F$15>0.001,AVERAGE(I15:I19),\"\")","v":13.5},{"$f":"IF($F$15>0.001,AVERAGE(J15:J19),\"\")","v":98.5},null,{"$f":"IF($F$15>0.001,AVERAGE(L15:L19),\"\")","v":0.15333761232349166},{"$f":"IF($F$15>0.001,AVERAGE(M15:M19),\"\")","v":0.40555840821566108},{"$f":"IF($F$15>0.001,AVERAGE(N15:N19),\"\")","v":0.30394094993581511},{"$f":"IF($F$15>0.001,AVERAGE(O15:O19),\"\")","v":0.13716302952503207},{"$f":"IF($F$15>0.001,AVERAGE(P15:P19),\"\")","v":1}]
[null,null,null,null,"哈伯德推荐",{"$f":"IF(L21=\"\",\"\",L21*100)","v":15},{"$f":"IF(M21=\"\",\"\",M21*100)","v":40},{"$f":"IF(N21=\"\",\"\",N21*100)","v":30},{"$f":"IF(O21=\"\",\"\",O21*100)","v":15},{"$f":"IF(P21=\"\",\"\",P21*100)","v":100},null,{"$f":"IF(VLOOKUP($F$11&$F$10&$L$14,Recommandations!A2:E97,5,0)=\"N/A\",\"\",VLOOKUP($F$11&$F$10&$L$14,Recommandations!A2:E97,5,0))","v":0.15},{"$f":"IF(VLOOKUP($F$11&$F$10&$M$14,Recommandations!$A$2:$E$97,5,0)=\"N/A\",\"\",VLOOKUP($F$11&$F$10&$M$14,Recommandations!$A$2:$E$97,5,0))","v":0.4},{"$f":"IF(VLOOKUP($F$11&$F$10&$N$14,Recommandations!$A$2:$E$97,5,0)=\"N/A\",\"\",VLOOKUP($F$11&$F$10&$N$14,Recommandations!$A$2:$E$97,5,0))","v":0.3},{"$f":"IF(VLOOKUP($F$11&$F$10&$O$14,Recommandations!$A$2:$E$97,5,0)=\"N/A\",\"\",VLOOKUP($F$11&$F$10&$O$14,Recommandations!$A$2:$E$97,5,0))","v":0.15},{"$f":"IF(SUM(L21:O21)=0,\"\",SUM(L21:O21))","v":1}]
[]
[]
[]
[]
[]
[]
[]
[]
[]
[]
[]
[]
[]
[]
[]
[]
[]
[]
[]
[]
[]
[null,null,null,null," 请咨询您当地的哈伯德技术经理以了解更多详细信息。"]
[null,null,null,null,"www.hubbardbreeders.com"]
[]
[null,null,null,null,"本资料中的性能数据均基于哈伯德公司内部试验鸡群及客户鸡群的记录结果编制。这些数据绝不表明我们能担保或保证其在不同营养、密度、物理或生物安全环境条件下饲养时亦能获得同样的结果。尤其是（不仅仅限于上述千差万别的条件）我们从不对产品的适用性、性能、用途、自然特性或品质作任何担保，也没有任何关于遵守当地有关健康、福利或动物生产其他方面的法规的保证。哈伯德公司对本资料所列示信息的完整性和准确性不承担责任。"]

{"sheet":"Recommandations","index":2,"n_rows":97,"n_cols":10,"rows_kept":97,"cut":false,"hidden":true,"merged":[]}
["ID","Form","Particle size","Feed type","Recommandation","Quality of feed presentation"]
[{"$f":"B2&D2&C2","v":"破碎料产前料<1mm"},"破碎料","<1mm","产前料",0.1,"Good",null,"破碎料","育雏早前料","PS Female EFFICIENCY PLUS"]
["破碎料产前料>3mm","破碎料",">3mm","产前料",0.5,"Good",null,"粗粉料","育雏料","PS Premium Female (JA57; JA57Ki; JA87; REDBRO; Redbro Mini; P6N)  "]
["破碎料产前料1-2mm","破碎料","1-2mm","产前料",0.1,"Good",null,"颗粒料","育成料","PS Males (M77/M99)"]
["破碎料产前料2-3mm","破碎料","2-3mm","产前料",0.3,"Good",null,null,"产前料","PS Males (Intermediate growth males, slow growth males)"]
["破碎料产蛋III号料<1mm","破碎料","<1mm","产蛋III号料",0.1,"Good",null,null,"开产料"]
["破碎料产蛋III号料>3mm","破碎料",">3mm","产蛋III号料",0.5,"Good",null,null,"产蛋I号料"]
["破碎料产蛋III号料1-2mm","破碎料","1-2mm","产蛋III号料",0.1,"Good",null,null,"产蛋II号料"]
["破碎料产蛋III号料2-3mm","破碎料","2-3mm","产蛋III号料",0.3,"Good",null,null,"产蛋III号料"]
["破碎料产蛋II号料<1mm","破碎料","<1mm","产蛋II号料",0.1,"Good"]
["破碎料产蛋II号料>3mm","破碎料",">3mm","产蛋II号料",0.5,"Good"]
["破碎料产蛋II号料1-2mm","破碎料","1-2mm","产蛋II号料",0.1,"Good"]
["破碎料产蛋II号料2-3mm","破碎料","2-3mm","产蛋II号料",0.3,"Good"]
["破碎料产蛋I号料<1mm","破碎料","<1mm","产蛋I号料",0.1,"Good"]
["破碎料产蛋I号料>3mm","破碎料",">3mm","产蛋I号料",0.5,"Good"]
["破碎料产蛋I号料1-2mm","破碎料","1-2mm","产蛋I号料",0.1,"Good"]
["破碎料产蛋I号料2-3mm","破碎料","2-3mm","产蛋I号料",0.3,"Good"]
["破碎料开产料<1mm","破碎料","<1mm","开产料",0.1,"Good"]
["破碎料开产料>3mm","破碎料",">3mm","开产料",0.5,"Good"]
["破碎料开产料1-2mm","破碎料","1-2mm","开产料",0.1,"Good"]
["破碎料开产料2-3mm","破碎料","2-3mm","开产料",0.3,"Good"]
["破碎料育成料<1mm","破碎料","<1mm","育成料",0.1,"Good"]
["破碎料育成料>3mm","破碎料",">3mm","育成料",0.5,"Good"]
["破碎料育成料1-2mm","破碎料","1-2mm","育成料",0.1,"Good"]
["破碎料育成料2-3mm","破碎料","2-3mm","育成料",0.3,"Good"]
["破碎料育雏料<1mm","破碎料","<1mm","育雏料",0.05,"Good"]
["破碎料育雏料>3mm","破碎料",">3mm","育雏料",0,"Good"]
["破碎料育雏料1-2mm","破碎料","1-2mm","育雏料",0.55000000000000004,"Good"]
["破碎料育雏料2-3mm","破碎料","2-3mm","育雏料",0.4,"Good"]
["破碎料育雏早前料<1mm","破碎料","<1mm","育雏早前料",0.05,"Good"]
["破碎料育雏早前料>3mm","破碎料",">3mm","育雏早前料",0,"Good"]
["破碎料育雏早前料1-2mm","破碎料","1-2mm","育雏早前料",0.55000000000000004,"Good"]
["破碎料育雏早前料2-3mm","破碎料","2-3mm","育雏早前料",0.4,"Good"]
[{"$f":"B34&D34&C34","v":"粗粉料产前料<1mm"},"粗粉料","<1mm","产前料",0.2,"Good"]
["粗粉料产前料>3mm","粗粉料",">3mm","产前料",0.1,"Good"]
["粗粉料产前料1-2mm","粗粉料","1-2mm","产前料",0.35,"Good"]
["粗粉料产前料2-3mm","粗粉料","2-3mm","产前料",0.35,"Good"]
["粗粉料产蛋III号料<1mm","粗粉料","<1mm","产蛋III号料",0.15,"Good"]
["粗粉料产蛋III号料>3mm","粗粉料",">3mm","产蛋III号料",0.15,"Good"]
["粗粉料产蛋III号料1-2mm","粗粉料","1-2mm","产蛋III号料",0.3,"Good"]
["粗粉料产蛋III号料2-3mm","粗粉料","2-3mm","产蛋III号料",0.4,"Good"]
["粗粉料产蛋II号料<1mm","粗粉料","<1mm","产蛋II号料",0.15,"Good"]
["粗粉料产蛋II号料>3mm","粗粉料",">3mm","产蛋II号料",0.15,"Good"]
["粗粉料产蛋II号料1-2mm","粗粉料","1-2mm","产蛋II号料",0.3,"Good"]
["粗粉料产蛋II号料2-3mm","粗粉料","2-3mm","产蛋II号料",0.4,"Good"]
["粗粉料产蛋I号料<1mm","粗粉料","<1mm","产蛋I号料",0.15,"Good"]
["粗粉料产蛋I号料>3mm","粗粉料",">3mm","产蛋I号料",0.15,"Good"]
["粗粉料产蛋I号料1-2mm","粗粉料","1-2mm","产蛋I号料",0.3,"Good"]
["粗粉料产蛋I号料2-3mm","粗粉料","2-3mm","产蛋I号料",0.4,"Good"]
["粗粉料开产料<1mm","粗粉料","<1mm","开产料",0.15,"Good"]
["粗粉料开产料>3mm","粗粉料",">3mm","开产料",0.15,"Good"]
["粗粉料开产料1-2mm","粗粉料","1-2mm","开产料",0.3,"Good"]
["粗粉料开产料2-3mm","粗粉料","2-3mm","开产料",0.4,"Good"]
["粗粉料育成料<1mm","粗粉料","<1mm","育成料",0.2,"Good"]
["粗粉料育成料>3mm","粗粉料",">3mm","育成料",0.1,"Good"]
["粗粉料育成料1-2mm","粗粉料","1-2mm","育成料",0.35,"Good"]
["粗粉料育成料2-3mm","粗粉料","2-3mm","育成料",0.35,"Good"]
["粗粉料育雏料<1mm","粗粉料","<1mm","育雏料",0.2,"Good"]
["粗粉料育雏料>3mm","粗粉料",">3mm","育雏料",0.05,"Good"]
["粗粉料育雏料1-2mm","粗粉料","1-2mm","育雏料",0.5,"Good"]
["粗粉料育雏料2-3mm","粗粉料","2-3mm","育雏料",0.25,"Good"]
["粗粉料育雏早前料<1mm","粗粉料","<1mm","育雏早前料",0.2,"Good"]
["粗粉料育雏早前料>3mm","粗粉料",">3mm","育雏早前料",0.05,"Good"]
["粗粉料育雏早前料1-2mm","粗粉料","1-2mm","育雏早前料",0.5,"Good"]
["粗粉料育雏早前料2-3mm","粗粉料","2-3mm","育雏早前料",0.25,"Good"]
[{"$f":"B66&D66&C66","v":"颗粒料产前料<1mm"},"颗粒料","<1mm","产前料",0.1,"Good"]
["颗粒料产前料>3mm","颗粒料",">3mm","产前料",0.7,"Good"]
["颗粒料产前料1-2mm","颗粒料","1-2mm","产前料",0.1,"Good"]
["颗粒料产前料2-3mm","颗粒料","2-3mm","产前料",0.1,"Good"]
["颗粒料产蛋III号料<1mm","颗粒料","<1mm","产蛋III号料",0.1,"Good"]
["颗粒料产蛋III号料>3mm","颗粒料",">3mm","产蛋III号料",0.7,"Good"]
["颗粒料产蛋III号料1-2mm","颗粒料","1-2mm","产蛋III号料",0.1,"Good"]
["颗粒料产蛋III号料2-3mm","颗粒料","2-3mm","产蛋III号料",0.1,"Good"]
["颗粒料产蛋II号料<1mm","颗粒料","<1mm","产蛋II号料",0.1,"Good"]
["颗粒料产蛋II号料>3mm","颗粒料",">3mm","产蛋II号料",0.7,"Good"]
["颗粒料产蛋II号料1-2mm","颗粒料","1-2mm","产蛋II号料",0.1,"Good"]
["颗粒料产蛋II号料2-3mm","颗粒料","2-3mm","产蛋II号料",0.1,"Good"]
["颗粒料产蛋I号料<1mm","颗粒料","<1mm","产蛋I号料",0.1,"Good"]
["颗粒料产蛋I号料>3mm","颗粒料",">3mm","产蛋I号料",0.7,"Good"]
["颗粒料产蛋I号料1-2mm","颗粒料","1-2mm","产蛋I号料",0.1,"Good"]
["颗粒料产蛋I号料2-3mm","颗粒料","2-3mm","产蛋I号料",0.1,"Good"]
["颗粒料开产料<1mm","颗粒料","<1mm","开产料",0.1,"Good"]
["颗粒料开产料>3mm","颗粒料",">3mm","开产料",0.7,"Good"]
["颗粒料开产料1-2mm","颗粒料","1-2mm","开产料",0.1,"Good"]
["颗粒料开产料2-3mm","颗粒料","2-3mm","开产料",0.1,"Good"]
["颗粒料育成料<1mm","颗粒料","<1mm","育成料",0.1,"Good"]
["颗粒料育成料>3mm","颗粒料",">3mm","育成料",0.7,"Good"]
["颗粒料育成料1-2mm","颗粒料","1-2mm","育成料",0.1,"Good"]
["颗粒料育成料2-3mm","颗粒料","2-3mm","育成料",0.1,"Good"]
["颗粒料育雏料<1mm","颗粒料","<1mm","育雏料","N/A","Good"]
["颗粒料育雏料>3mm","颗粒料",">3mm","育雏料","N/A","Good"]
["颗粒料育雏料1-2mm","颗粒料","1-2mm","育雏料","N/A","Good"]
["颗粒料育雏料2-3mm","颗粒料","2-3mm","育雏料","N/A","Good"]
["颗粒料育雏早前料<1mm","颗粒料","<1mm","育雏早前料","N/A","Good"]
["颗粒料育雏早前料>3mm","颗粒料",">3mm","育雏早前料","N/A","Good"]
["颗粒料育雏早前料1-2mm","颗粒料","1-2mm","育雏早前料","N/A","Good"]
["颗粒料育雏早前料2-3mm","颗粒料","2-3mm","育雏早前料","N/A","Good"]